BDBM50443037 CHEMBL3087798
SMILES CCN(CC)CCNS(=O)(=O)c1ccc(cc1)[N+]([O-])=O
InChI Key InChIKey=JXHCBKXMCLKRFZ-UHFFFAOYSA-N
Data  1 IC50
  Tab Delimited (TSV)   2D SDfile   Computed 3D by Vconf -m prep SDfile
Find this compound or compounds like it in BindingDB:
Activity Spreadsheet -- Enzyme Inhibition Constant Data from BindingDB
Found 1 hit for monomerid = 50443037
TargetAcetylcholinesterase(Mus musculus (mouse))
Ume£
Curated by ChEMBL
LigandPNGBDBM50443037(CHEMBL3087798)
Affinity DataIC50:  9.50E+4nM. Assay description: Inhibition of mouse recombinant AChE using acetylthiocholine iodide as substrate by Ellman's method
In DepthDetails ArticlePubMed