BDBM50443258 CHEMBL3087056
SMILES Cc1cc(cc(C)c1O)N=Nc1ccc(cc1)S(=O)(=O)Nc1cc(Cl)ccn1
InChI Key InChIKey=NWRSZGDBXDGLBP-UHFFFAOYSA-N
Data  2 KI
  Tab Delimited (TSV)   2D SDfile   Computed 3D by Vconf -m prep SDfile
Find this compound or compounds like it in BindingDB:
Activity Spreadsheet -- Enzyme Inhibition Constant Data from BindingDB
Found 2 hits for monomerid = 50443258
TargetBromodomain-containing protein 4(Homo sapiens (Human))
Icahn School Of Medicine At Mount Sinai
Curated by ChEMBL
LigandPNGBDBM50443258(CHEMBL3087056)
Affinity DataKi:  900nM. Assay description: Displacement of fluorescein-labeled MS574 from recombinant human BRD4 BrD1 after 1 hr by fluorescence anisotropy assay
In DepthDetails ArticlePubMed
TargetBromodomain-containing protein 4(Homo sapiens (Human))
Icahn School Of Medicine At Mount Sinai
Curated by ChEMBL
LigandPNGBDBM50443258(CHEMBL3087056)
Affinity DataKi:  5.92E+3nM. Assay description: Displacement of fluorescein-labeled MS574 from recombinant human BRD4 BrD2 after 1 hr by fluorescence anisotropy assay
In DepthDetails ArticlePubMed