BDBM50443260 CHEMBL3087054
SMILES CN(c1ccccn1)S(=O)(=O)c1ccc(cc1)N=Nc1cc(C)c(O)c(C)c1
InChI Key InChIKey=BZNOQPWEFIWTQI-UHFFFAOYSA-N
Data  2 KI
  Tab Delimited (TSV)   2D SDfile   Computed 3D by Vconf -m prep SDfile
Find this compound or compounds like it in BindingDB:
Activity Spreadsheet -- Enzyme Inhibition Constant Data from BindingDB
Found 2 hits for monomerid = 50443260
TargetBromodomain-containing protein 4(Homo sapiens (Human))
Icahn School Of Medicine At Mount Sinai
Curated by ChEMBL
LigandPNGBDBM50443260(CHEMBL3087054)
Affinity DataKi:  7.12E+3nM. Assay description: Displacement of fluorescein-labeled MS574 from recombinant human BRD4 BrD2 after 1 hr by fluorescence anisotropy assay
In DepthDetails ArticlePubMed
TargetBromodomain-containing protein 4(Homo sapiens (Human))
Icahn School Of Medicine At Mount Sinai
Curated by ChEMBL
LigandPNGBDBM50443260(CHEMBL3087054)
Affinity DataKi:  7.89E+3nM. Assay description: Displacement of fluorescein-labeled MS574 from recombinant human BRD4 BrD1 after 1 hr by fluorescence anisotropy assay
In DepthDetails ArticlePubMed