BDBM50443264 CHEMBL3087058
SMILES C\C(CC\C=C(\C)C=C)=C/c1cc(co1)C(O)=O
InChI Key InChIKey=CWSVEYKHSSZGRW-MOUHLLIUSA-N
Data  1 IC50
  Tab Delimited (TSV)   2D SDfile   Computed 3D by Vconf -m prep SDfile
Find this compound or compounds like it in BindingDB:
Activity Spreadsheet -- Enzyme Inhibition Constant Data from BindingDB
Found 1 hit for monomerid = 50443264
TargetPhospholipase A2(Apis mellifera)
Csir-Iict
Curated by ChEMBL
LigandPNGBDBM50443264(CHEMBL3087058)
Affinity DataIC50:  5.00E+5nM. Assay description: Inhibition of bee venom phospholipase A2
In DepthDetails ArticlePubMed