BDBM50443395 CHEMBL1315807
SMILES Cc1c(n2ccccc2[n+]1CCc1ccccc1)P(=S)(c1ccccc1)c1ccccc1
InChI Key InChIKey=LLAPOGNBVGIRHM-UHFFFAOYSA-N
Data  3 IC50
  Tab Delimited (TSV)   2D SDfile   Computed 3D by Vconf -m prep SDfile
Find this compound or compounds like it in BindingDB:
Activity Spreadsheet -- Enzyme Inhibition Constant Data from BindingDB
Found 3 hits for monomerid = 50443395
TargetNeuropeptide S receptor(Homo sapiens (Human))
National Institutes Of Health
Curated by ChEMBL
LigandPNGBDBM50443395(CHEMBL1315807)
Affinity DataIC50:  16nM. Assay description: Antagonist activity at neuropeptide S receptor (unknown origin) expressed in CHO cells assessed as inhibition of NPS-induced ERK activation after 20 ...
In DepthDetails ArticlePubMed
TargetNeuropeptide S receptor(Homo sapiens (Human))
National Institutes Of Health
Curated by ChEMBL
LigandPNGBDBM50443395(CHEMBL1315807)
Affinity DataIC50:  2.10E+3nM. Assay description: Antagonist activity at neuropeptide S receptor (unknown origin) expressed in CHO cells assessed as cAMP level after 30 mins by phosphate-buffered sal...
In DepthDetails ArticlePubMed
TargetNeuropeptide S receptor(Homo sapiens (Human))
National Institutes Of Health
Curated by ChEMBL
LigandPNGBDBM50443395(CHEMBL1315807)
Affinity DataIC50:  73nM. Assay description: Antagonist activity at neuropeptide S receptor (unknown origin) expressed in CHO cells assessed as inhibition of NPS-induced calcium mobilization aft...
In DepthDetails ArticlePubMed