BDBM50443543 CHEMBL3091685
SMILES NC(=O)NCCCCN(C[C@H]1Cc2ccccc2CN1)[C@H]1CCCc2cccnc12
InChI Key InChIKey=VETWTFKXJFDZKC-YADHBBJMSA-N
Data  2 IC50
  Tab Delimited (TSV)   2D SDfile   Computed 3D by Vconf -m prep SDfile
Find this compound or compounds like it in BindingDB:
Activity Spreadsheet -- Enzyme Inhibition Constant Data from BindingDB
Found 2 hits for monomerid = 50443543
TargetC-X-C chemokine receptor type 4(Homo sapiens (Human))
Emory University
Curated by ChEMBL
LigandPNGBDBM50443543(CHEMBL3091685)
Affinity DataIC50:  210nM. Assay description: Antagonist activity at CXCR4 in human MAGI-CCR5 cells assessed as inhibition of HIV-1 3B entry after 2 to 6 days by beta-galactosidase reporter gene ...
In DepthDetails ArticlePubMed
TargetC-X-C chemokine receptor type 4(Homo sapiens (Human))
Emory University
Curated by ChEMBL
LigandPNGBDBM50443543(CHEMBL3091685)
Affinity DataIC50:  3nM. Assay description: Antagonist activity at CXCR4 in human Chem-1 cells assessed as inhibition of SDF-1alpha-mediated calcium flux preincubated for 10 mins by FLIPR assay
In DepthDetails ArticlePubMed