BDBM50443744 CHEMBL3091488
SMILES N[C@@H](Cc1ccc(F)c(F)c1F)C(=O)N1C[C@@H](F)C[C@H]1C#N
InChI Key InChIKey=LMCNNCISVGRBQK-QXEWZRGKSA-N
Data  3 IC50
  Tab Delimited (TSV)   2D SDfile   Computed 3D by Vconf -m prep SDfile
Find this compound or compounds like it in BindingDB:
Activity Spreadsheet -- Enzyme Inhibition Constant Data from BindingDB
Found 3 hits for monomerid = 50443744
TargetProlyl endopeptidase FAP(Homo sapiens (Human))
Chinese Academy Of Sciences
Curated by ChEMBL
LigandPNGBDBM50443744(CHEMBL3091488)
Affinity DataIC50:  220nM. Assay description: Inhibition of 6xHis-tagged recombinant FAP (unknown origin) expressed in baculovirus expression system assessed as hydrolysis of Nle-Pro-aminomethylc...
In DepthDetails ArticlePubMed
TargetDipeptidyl peptidase 8(Homo sapiens (Human))
Chinese Academy Of Sciences
Curated by ChEMBL
LigandPNGBDBM50443744(CHEMBL3091488)
Affinity DataIC50:  1.07E+3nM. Assay description: Inhibition of 6xHis-tagged recombinant DPP8 (unknown origin) expressed in baculovirus expression system assessed as hydrolysis of Ala-Pro-aminomethyl...
In DepthDetails ArticlePubMed
TargetDipeptidyl peptidase 9(Homo sapiens (Human))
Chinese Academy Of Sciences
Curated by ChEMBL
LigandPNGBDBM50443744(CHEMBL3091488)
Affinity DataIC50:  1.00E+3nM. Assay description: Inhibition of 6xHis-tagged recombinant DPP9 (unknown origin) expressed in baculovirus expression system assessed as hydrolysis of Ala-Pro-aminomethyl...
In DepthDetails ArticlePubMed