BDBM50443873 CHEMBL3091543
SMILES Cn1c(nc(cc1=O)-c1ccncn1)N1CCO[C@H](C1)c1ccc(cc1F)C#N
InChI Key InChIKey=FBYAMCXCCZZPAA-GOSISDBHSA-N
Data  2 IC50
  Tab Delimited (TSV)   2D SDfile   Computed 3D by Vconf -m prep SDfile
Find this compound or compounds like it in BindingDB:
Activity Spreadsheet -- Enzyme Inhibition Constant Data from BindingDB
Found 2 hits for monomerid = 50443873
TargetCytochrome P450 1A2(Homo sapiens (Human))
Mitsubishi Tanabe Pharma
Curated by ChEMBL
LigandPNGBDBM50443873(CHEMBL3091543)
Affinity DataIC50: >5.00E+4nM. Assay description: Inhibition of recombinant human CYP1A2
In DepthDetails ArticlePubMed
TargetCytochrome P450 2D6(Homo sapiens (Human))
Mitsubishi Tanabe Pharma
Curated by ChEMBL
LigandPNGBDBM50443873(CHEMBL3091543)
Affinity DataIC50:  2.67E+4nM. Assay description: Inhibition of recombinant human CYP2D6
In DepthDetails ArticlePubMed