BDBM50443875 CHEMBL3091541
SMILES COc1cc(F)ccc1[C@H]1CN(CCO1)c1nc(cc(=O)n1C)-c1ccncn1
InChI Key InChIKey=CDBWMFAEYVBQCU-GOSISDBHSA-N
Data  2 IC50
  Tab Delimited (TSV)   2D SDfile   Computed 3D by Vconf -m prep SDfile
Find this compound or compounds like it in BindingDB:
Activity Spreadsheet -- Enzyme Inhibition Constant Data from BindingDB
Found 2 hits for monomerid = 50443875
TargetCytochrome P450 1A2(Homo sapiens (Human))
Mitsubishi Tanabe Pharma
Curated by ChEMBL
LigandPNGBDBM50443875(CHEMBL3091541)
Affinity DataIC50:  1.65E+4nM. Assay description: Inhibition of recombinant human CYP1A2
In DepthDetails ArticlePubMed
TargetCytochrome P450 2D6(Homo sapiens (Human))
Mitsubishi Tanabe Pharma
Curated by ChEMBL
LigandPNGBDBM50443875(CHEMBL3091541)
Affinity DataIC50:  1.80E+4nM. Assay description: Inhibition of recombinant human CYP2D6
In DepthDetails ArticlePubMed