BDBM50443877 CHEMBL3091539
SMILES Cn1c(nc(cc1=O)-c1ccncn1)N1CCO[C@H](C1)c1ccccc1F
InChI Key InChIKey=MRFZAIJGZOAMQT-QGZVFWFLSA-N
Data  2 IC50
  Tab Delimited (TSV)   2D SDfile   Computed 3D by Vconf -m prep SDfile
Find this compound or compounds like it in BindingDB:
Activity Spreadsheet -- Enzyme Inhibition Constant Data from BindingDB
Found 2 hits for monomerid = 50443877
TargetCytochrome P450 1A2(Homo sapiens (Human))
Mitsubishi Tanabe Pharma
Curated by ChEMBL
LigandPNGBDBM50443877(CHEMBL3091539)
Affinity DataIC50:  2.33E+4nM. Assay description: Inhibition of recombinant human CYP1A2
In DepthDetails ArticlePubMed
TargetCytochrome P450 2D6(Homo sapiens (Human))
Mitsubishi Tanabe Pharma
Curated by ChEMBL
LigandPNGBDBM50443877(CHEMBL3091539)
Affinity DataIC50:  3.24E+4nM. Assay description: Inhibition of recombinant human CYP2D6
In DepthDetails ArticlePubMed