BDBM50443973 CHEMBL3092294
SMILES Nc1ccc2sc(cc2c1)C1CN2C=CSC2=N1
InChI Key InChIKey=QBUGINCPNXHNSQ-UHFFFAOYSA-N
Data  4 IC50
  Tab Delimited (TSV)   2D SDfile   Computed 3D by Vconf -m prep SDfile
Find this compound or compounds like it in BindingDB:
Activity Spreadsheet -- Enzyme Inhibition Constant Data from BindingDB
Found 4 hits for monomerid = 50443973
TargetIntestinal-type alkaline phosphatase(Homo sapiens (Human))
Universit£
Curated by ChEMBL
LigandPNGBDBM50443973(CHEMBL3092294)
Affinity DataIC50: >4.00E+5nM. Assay description: Inhibition of intestinal alkaline phosphatase (unknown origin) assessed as para nitrophenylphosphate conversion to p-nitrophenolate at pH 10.4 incuba...
In DepthDetails ArticlePubMed
TargetAlkaline phosphatase, placental type(Homo sapiens (Human))
Universit£
Curated by ChEMBL
LigandPNGBDBM50443973(CHEMBL3092294)
Affinity DataIC50: >4.00E+5nM. Assay description: Inhibition of placental alkaline phosphatase (unknown origin) assessed as para nitrophenylphosphate conversion to p-nitrophenolate at pH 7.8 incubate...
In DepthDetails ArticlePubMed
TargetAlkaline phosphatase, placental type(Homo sapiens (Human))
Universit£
Curated by ChEMBL
LigandPNGBDBM50443973(CHEMBL3092294)
Affinity DataIC50: >4.00E+5nM. Assay description: Inhibition of placental alkaline phosphatase (unknown origin) assessed as para nitrophenylphosphate conversion to p-nitrophenolate at pH 10.4 incubat...
In DepthDetails ArticlePubMed
TargetIntestinal-type alkaline phosphatase(Homo sapiens (Human))
Universit£
Curated by ChEMBL
LigandPNGBDBM50443973(CHEMBL3092294)
Affinity DataIC50: >4.00E+5nM. Assay description: Inhibition of intestinal alkaline phosphatase (unknown origin) assessed as para nitrophenylphosphate conversion to p-nitrophenolate at pH 7.8 incubat...
In DepthDetails ArticlePubMed