BDBM50444013 CHEMBL3092492
SMILES N#Cc1cccc(Nc2ncnc3ccccc23)c1
InChI Key InChIKey=ILIMEQICLLIMCT-UHFFFAOYSA-N
Data  2 IC50
  Tab Delimited (TSV)   2D SDfile   Computed 3D by Vconf -m prep SDfile
Find this compound or compounds like it in BindingDB:
Activity Spreadsheet -- Enzyme Inhibition Constant Data from BindingDB
Found 2 hits for monomerid = 50444013
TargetBroad substrate specificity ATP-binding cassette transporter ABCG2(Homo sapiens (Human))
University Of Bonn
Curated by ChEMBL
LigandPNGBDBM50444013(CHEMBL3092492)
Affinity DataIC50:  1.18E+3nM. Assay description: Inhibition of human BCRP expressed in MDCK2 cells assessed as Hoechst 33342 accumulation treated 30 mins before Hoechst 33342 addition measured up to...
In DepthDetails ArticlePubMed
TargetBroad substrate specificity ATP-binding cassette transporter ABCG2(Homo sapiens (Human))
University Of Bonn
Curated by ChEMBL
LigandPNGBDBM50444013(CHEMBL3092492)
Affinity DataIC50:  2.03E+3nM. Assay description: Inhibition of human BCRP expressed in MDCK2 cells assessed as pheophorbide A accumulation treated 30 mins before pheophorbide A addition measured up ...
In DepthDetails ArticlePubMed