BDBM50444114 CHEMBL3093161
SMILES Nc1ncc(cc1-c1nc2ccc(Oc3ccc(F)cc3)cc2o1)-c1cnn(c1)C1CCNCC1
InChI Key InChIKey=YDPJBCGCRBWWKA-UHFFFAOYSA-N
Data  2 IC50
  Tab Delimited (TSV)   2D SDfile   Computed 3D by Vconf -m prep SDfile
Find this compound or compounds like it in BindingDB:
Activity Spreadsheet -- Enzyme Inhibition Constant Data from BindingDB
Found 2 hits for monomerid = 50444114
TargetBeta-adrenergic receptor kinase 1(Homo sapiens (Human))
Korea Research Institute Of Chemical Technology
Curated by ChEMBL
LigandPNGBDBM50444114(CHEMBL3093161)
Affinity DataIC50: >1.00E+4nM. Assay description: Inhibition of GRK-2 (unknown origin) preincubated with enzyme for 10 mins before adding peptide substrate and ATP measured after 1 hr by LANCE-TR-FRE...
In DepthDetails ArticlePubMed
TargetG protein-coupled receptor kinase 5(Homo sapiens (Human))
Korea Research Institute Of Chemical Technology
Curated by ChEMBL
LigandPNGBDBM50444114(CHEMBL3093161)
Affinity DataIC50:  7.90E+3nM. Assay description: Inhibition of GRK-5 (unknown origin) preincubated with enzyme for 10 mins before adding peptide substrate and ATP measured after 1 hr by LANCE-TR-FRE...
In DepthDetails ArticlePubMed