BDBM50444231 CHEMBL3093591
SMILES OC(=O)Cc1cnc(C(=O)c2ccc(cc2)C(=O)NCCc2ccc(Cl)c(Cl)c2)c2ccccc12
InChI Key InChIKey=DEKAJKZBTSPPSU-UHFFFAOYSA-N
Data  2 IC50
  Tab Delimited (TSV)   2D SDfile   Computed 3D by Vconf -m prep SDfile
Find this compound or compounds like it in BindingDB:
Activity Spreadsheet -- Enzyme Inhibition Constant Data from BindingDB
Found 2 hits for monomerid = 50444231
TargetProstaglandin D2 receptor 2(Homo sapiens (Human))
Taisho Pharmaceutical
Curated by ChEMBL
LigandPNGBDBM50444231(CHEMBL3093591)
Affinity DataIC50:  3.70nM. Assay description: Displacement of [3H]PGD2 from human CRTH2 transfected in CHO cells by liquid scintillation counting analysis
In DepthDetails ArticlePubMed
TargetProstaglandin D2 receptor 2(Homo sapiens (Human))
Taisho Pharmaceutical
Curated by ChEMBL
LigandPNGBDBM50444231(CHEMBL3093591)
Affinity DataIC50:  18nM. Assay description: Antagonist activity at human CRTH2 transfected in human KB8 cells assessed as inhibition of PGD2-induced increase in intracellular Ca2+ by fluo-4AM d...
In DepthDetails ArticlePubMed