BDBM50444438 CHEMBL2442495
SMILES Cc1c(nn(-c2nc(cs2)C(O)=O)c1-c1ccccc1)-c1ccccc1
InChI Key InChIKey=QEOBCNBMVHTMBU-UHFFFAOYSA-N
Data  4 KI  6 IC50
  Tab Delimited (TSV)   2D SDfile   Computed 3D by Vconf -m prep SDfile
Find this compound or compounds like it in BindingDB:
Activity Spreadsheet -- Enzyme Inhibition Constant Data from BindingDB
Found 10 hits for monomerid = 50444438
TargetProstaglandin E2 receptor EP1 subtype(Homo sapiens (Human))
Asahi Kasei Pharma
Curated by ChEMBL
LigandPNGBDBM50444438(CHEMBL2442495)
Affinity DataKi:  290nM. Assay description: Binding affinity to human EP1 receptor
In DepthDetails ArticlePubMed
TargetProstaglandin E2 receptor EP4 subtype(Homo sapiens (Human))
Asahi Kasei Pharma
Curated by ChEMBL
LigandPNGBDBM50444438(CHEMBL2442495)
Affinity DataKi: >2.70E+3nM. Assay description: Binding affinity to human EP4 receptor
In DepthDetails ArticlePubMed
TargetProstaglandin E2 receptor EP3 subtype(Homo sapiens (Human))
Asahi Kasei Pharma
Curated by ChEMBL
LigandPNGBDBM50444438(CHEMBL2442495)
Affinity DataKi: >5.00E+3nM. Assay description: Binding affinity to human EP3 receptor
In DepthDetails ArticlePubMed
TargetProstaglandin E2 receptor EP2 subtype(Homo sapiens (Human))
Asahi Kasei Pharma
Curated by ChEMBL
LigandPNGBDBM50444438(CHEMBL2442495)
Affinity DataKi: >8.00E+3nM. Assay description: Binding affinity to human EP2 receptor
In DepthDetails ArticlePubMed
TargetCytochrome P450 2D6(Homo sapiens (Human))
Asahi Kasei Pharma
Curated by ChEMBL
LigandPNGBDBM50444438(CHEMBL2442495)
Affinity DataIC50: >1.00E+4nM. Assay description: Inhibition of human CYP2D6
In DepthDetails ArticlePubMed
TargetProstaglandin E2 receptor EP1 subtype(Homo sapiens (Human))
Asahi Kasei Pharma
Curated by ChEMBL
LigandPNGBDBM50444438(CHEMBL2442495)
Affinity DataIC50:  500nM. Assay description: Antagonist activity at human EP1 receptor by intracellular Ca2+ release assay
In DepthDetails ArticlePubMed
TargetCytochrome P450 1A2(Homo sapiens (Human))
Asahi Kasei Pharma
Curated by ChEMBL
LigandPNGBDBM50444438(CHEMBL2442495)
Affinity DataIC50:  7.93E+3nM. Assay description: Inhibition of human CYP1A2
In DepthDetails ArticlePubMed
TargetCytochrome P450 2C9(Homo sapiens (Human))
Asahi Kasei Pharma
Curated by ChEMBL
LigandPNGBDBM50444438(CHEMBL2442495)
Affinity DataIC50: >1.00E+4nM. Assay description: Inhibition of human CYP2C9
In DepthDetails ArticlePubMed
TargetCytochrome P450 2C19(Homo sapiens (Human))
Asahi Kasei Pharma
Curated by ChEMBL
LigandPNGBDBM50444438(CHEMBL2442495)
Affinity DataIC50:  4.71E+3nM. Assay description: Inhibition of human CYP2C19
In DepthDetails ArticlePubMed
TargetProstaglandin E2 receptor EP1 subtype(Homo sapiens (Human))
Asahi Kasei Pharma
Curated by ChEMBL
LigandPNGBDBM50444438(CHEMBL2442495)
Affinity DataIC50:  50nM. Assay description: Antagonist activity at human EP1 receptor by reporter gene assay
In DepthDetails ArticlePubMed