BDBM50444590 CHEMBL3099727
SMILES CC[C@H](C)[C@H](N)C(=O)N[C@@H](CCCCN)C(=O)N1CCC[C@H]1C(=O)N[C@@H](CCC(O)=O)C(=O)N[C@@H](C)C(=O)N1CCC[C@H]1C(=O)NCC(=O)N[C@@H](CCC(O)=O)C(=O)N[C@@H](CC(O)=O)C(=O)N[C@@H](C)C(=O)N[C@@H](CO)C(=O)N1CCC[C@H]1C(=O)N[C@@H](CCC(O)=O)C(=O)N[C@@H](CCC(O)=O)C(=O)N[C@@H](CC(C)C)C(=O)N[C@@H](CC(N)=O)C(=O)N[C@@H](CCCNC(N)=N)C(=O)N[C@@H](Cc1ccc(O)cc1)C(=O)N[C@@H](Cc1ccc(O)cc1)C(=O)N[C@@H](C)C(=O)N[C@@H](CO)C(=O)N[C@@H](CC(C)C)C(=O)N[C@@H](CCCNC(N)=N)C(=O)N[C@@H](Cc1cnc[nH]1)C(=O)N[C@@H](Cc1ccc(O)cc1)C(=O)N[C@@H](CC(C)C)C(=O)N[C@@H](CC(N)=O)C(=O)N[C@@H](C)C(=O)N[C@@H](C(C)C)C(=O)N[C@@H]([C@@H](C)O)C(=O)O[C@@H](CCCNC(N)=N)C(=O)N[C@@H](CCC(N)=O)C(=O)N[C@@H](CCCNC(N)=N)C(=O)N[C@@H](Cc1ccc(O)cc1)C(N)=O
InChI Key InChIKey=RZGHNTSWGIVJFH-NGUHXVKZSA-N
Data  4 EC50
  Tab Delimited (TSV)   2D SDfile   Computed 3D by Vconf -m prep SDfile
Find this compound or compounds like it in BindingDB:
Activity Spreadsheet -- Enzyme Inhibition Constant Data from BindingDB
Found 4 hits for monomerid = 50444590
TargetNeuropeptide Y receptor type 4(Homo sapiens (Human))
University Of Copenhagen
Curated by ChEMBL
LigandPNGBDBM50444590(CHEMBL3099727)
Affinity DataEC50: >500nM. Assay description: Agonist activity at human NPYY4 receptor expressed in HEK293 cells assessed as decrease in isoproterenol-induced cAMP level measured every 30 secs fo...
In DepthDetails ArticlePubMed
TargetNeuropeptide Y receptor type 5(Homo sapiens (Human))
University Of Copenhagen
Curated by ChEMBL
LigandPNGBDBM50444590(CHEMBL3099727)
Affinity DataEC50:  112nM. Assay description: Agonist activity at human NPYY5 receptor expressed in HEK293 cells assessed as decrease in isoproterenol-induced cAMP level measured every 30 secs fo...
In DepthDetails ArticlePubMed
TargetNeuropeptide Y receptor type 1(Homo sapiens (Human))
University Of Copenhagen
Curated by ChEMBL
LigandPNGBDBM50444590(CHEMBL3099727)
Affinity DataEC50: >500nM. Assay description: Agonist activity at human NPYY1 receptor expressed in HEK293 cells assessed as decrease in isoproterenol-induced cAMP level measured every 30 secs fo...
In DepthDetails ArticlePubMed
TargetNeuropeptide Y receptor type 2(Homo sapiens (Human))
University Of Copenhagen
Curated by ChEMBL
LigandPNGBDBM50444590(CHEMBL3099727)
Affinity DataEC50:  3.60nM. Assay description: Agonist activity at human NPYY2 receptor expressed in HEK293 cells assessed as decrease in isoproterenol-induced cAMP level measured every 30 secs fo...
In DepthDetails ArticlePubMed