BDBM50444668 CHEMBL3098665
SMILES [#6]-[#6]-[#6@H](-[#6])-[#6@H](-[#7]-[#6](=O)-[#6@H](-[#6]-[#6](-[#6])-[#6])-[#7]-[#6](=O)-[#6@H](-[#6]-[#6]-[#6]\[#7]=[#6](/[#7])-[#7])-[#7]-[#6](=O)-c1ccc(-[#6]-n2cccn2)o1)-[#6](=O)-[#7]-[#6@@H](-[#6]-c1ccccc1)-[#6](-[#8])=O
InChI Key InChIKey=ZXKDFDMIVZBZTD-NFWZRYHXSA-N
Data  2 IC50
  Tab Delimited (TSV)   2D SDfile   Computed 3D by Vconf -m prep SDfile
Find this compound or compounds like it in BindingDB:
Activity Spreadsheet -- Enzyme Inhibition Constant Data from BindingDB
Found 2 hits for monomerid = 50444668
TargetCyclin-dependent kinase 4/G1/S-specific cyclin-D1(Homo sapiens (Human))
University Of South Carolina
Curated by ChEMBL
LigandPNGBDBM50444668(CHEMBL3098665)
Affinity DataIC50: >1.00E+5nM. Assay description: Inhibition of human recombinant CDK4/cyclin D1 using fluoresceinyl-Ahx-Pro-Val-Lys-Arg-Arg-Leu-(3ClPhe)-Gly as substrate after 45 mins by fluorescenc...
In DepthDetails ArticlePubMed
TargetCyclin-A2/Cyclin-dependent kinase 2(Homo sapiens (Human))
University Of South Carolina
Curated by ChEMBL
LigandPNGBDBM50444668(CHEMBL3098665)
Affinity DataIC50: >1.00E+5nM. Assay description: Inhibition of human recombinant CDK2/cyclin A using fluoresceinyl-Ahx-Pro-Val-Lys-Arg-Arg-Leu-Phe-Gly as substrate after 45 mins by fluorescence pola...
In DepthDetails ArticlePubMed