BDBM50444821 CHEMBL3099235
SMILES CCCN1C[C@@H](Cn2cncn2)O[C@@H]2Cc3c(O)cccc3C[C@@H]12
InChI Key InChIKey=BZWLDSMYMFIKPT-YXJHDRRASA-N
Data  1 EC50
  Tab Delimited (TSV)   2D SDfile   Computed 3D by Vconf -m prep SDfile
Find this compound or compounds like it in BindingDB:
Activity Spreadsheet -- Enzyme Inhibition Constant Data from BindingDB
Found 1 hit for monomerid = 50444821
TargetD(2) dopamine receptor(Homo sapiens (Human))
University Of Copenhagen
Curated by ChEMBL
LigandPNGBDBM50444821(CHEMBL3099235)
Affinity DataEC50:  0.5nM. Assay description: Agonist activity at human dopamine D2 receptor expressed in CHO cells assessed as increase of forskolin-induced cAMP production after 20 mins
In DepthDetails ArticlePubMed