BDBM50444868 CHEMBL3099487
SMILES Oc1ccc(CCN[C@@H]2CO[C@@H](C2)C(c2ccccc2)c2ccccc2)cc1
InChI Key InChIKey=YDGJPDWCABYRPM-UPVQGACJSA-N
Data  1 KI
  Tab Delimited (TSV)   2D SDfile   Computed 3D by Vconf -m prep SDfile
Find this compound or compounds like it in BindingDB:
Activity Spreadsheet -- Enzyme Inhibition Constant Data from BindingDB
Found 1 hit for monomerid = 50444868
TargetTransporter(Rattus norvegicus (rat))
Wayne State University
Curated by ChEMBL
LigandPNGBDBM50444868(CHEMBL3099487)
Affinity DataKi:  165nM. Assay description: Displacement of [3H]-dopamine from rat cerebral cortex NET after 7 mins
In DepthDetails ArticlePubMed