BDBM50444885 CHEMBL3099637
SMILES CC(c1ccc(OCCN2CCCCCC2)cc1)c1ccc(OCCN2CCCCCC2)cc1
InChI Key InChIKey=UUODGPHLMZLCLQ-UHFFFAOYSA-N
Data  3 IC50
  Tab Delimited (TSV)   2D SDfile   Computed 3D by Vconf -m prep SDfile
Find this compound or compounds like it in BindingDB:
Activity Spreadsheet -- Enzyme Inhibition Constant Data from BindingDB
Found 3 hits for monomerid = 50444885
TargetProteasome subunit beta type-2(Homo sapiens (Human))
Institute Of Bio-Science And Technology
Curated by ChEMBL
LigandPNGBDBM50444885(CHEMBL3099637)
Affinity DataIC50: >1.00E+4nM. Assay description: Inhibition of trypsin-like activity of human 20S proteasome beta 2 subunit assessed as hydrolysis of Boc-LRR-AMC fluorogenic substrate measured for 1...
In DepthDetails ArticlePubMed
TargetProteasome subunit beta type-1(Homo sapiens (Human))
Institute Of Bio-Science And Technology
Curated by ChEMBL
LigandPNGBDBM50444885(CHEMBL3099637)
Affinity DataIC50:  790nM. Assay description: Inhibition of PGPH-like activity of human 20S proteasome beta 1 subunit assessed as hydrolysis of Z-LLE-AMC fluorogenic substrate measured for 1 hr b...
In DepthDetails ArticlePubMed
TargetProteasome subunit beta type-5(Homo sapiens (Human))
Institute Of Bio-Science And Technology
Curated by ChEMBL
LigandPNGBDBM50444885(CHEMBL3099637)
Affinity DataIC50:  800nM. Assay description: Inhibition of chymotrypsin-like activity of human 20S proteasome beta 5 subunit assessed as hydrolysis of succinyl-LLVY-AMC fluorogenic substrate mea...
In DepthDetails ArticlePubMed