BDBM50444893 CHEMBL3099616
SMILES [#6]-[#6]\[#6](=[#6](\c1ccc(-[#8]-[#6]-[#6]-[#7](-[#6])-[#6])cc1)-c1ccc(-[#8]-[#6]-[#6]-[#7](-[#6])-[#6])cc1)-c1ccccc1
InChI Key InChIKey=PHWQXJUZLDVCCI-UHFFFAOYSA-N
Data  3 IC50
  Tab Delimited (TSV)   2D SDfile   Computed 3D by Vconf -m prep SDfile
Find this compound or compounds like it in BindingDB:
Activity Spreadsheet -- Enzyme Inhibition Constant Data from BindingDB
Found 3 hits for monomerid = 50444893
TargetProteasome subunit beta type-2(Homo sapiens (Human))
Institute Of Bio-Science And Technology
Curated by ChEMBL
LigandPNGBDBM50444893(CHEMBL3099616)
Affinity DataIC50: >1.00E+4nM. Assay description: Inhibition of trypsin-like activity of human 20S proteasome beta 2 subunit assessed as hydrolysis of Boc-LRR-AMC fluorogenic substrate measured for 1...
In DepthDetails ArticlePubMed
TargetProteasome subunit beta type-1(Homo sapiens (Human))
Institute Of Bio-Science And Technology
Curated by ChEMBL
LigandPNGBDBM50444893(CHEMBL3099616)
Affinity DataIC50:  2.99E+3nM. Assay description: Inhibition of PGPH-like activity of human 20S proteasome beta 1 subunit assessed as hydrolysis of Z-LLE-AMC fluorogenic substrate measured for 1 hr b...
In DepthDetails ArticlePubMed
TargetProteasome subunit beta type-5(Homo sapiens (Human))
Institute Of Bio-Science And Technology
Curated by ChEMBL
LigandPNGBDBM50444893(CHEMBL3099616)
Affinity DataIC50:  3.36E+3nM. Assay description: Inhibition of chymotrypsin-like activity of human 20S proteasome beta 5 subunit assessed as hydrolysis of succinyl-LLVY-AMC fluorogenic substrate mea...
In DepthDetails ArticlePubMed