BDBM50445056 CHEMBL3098743::US10195186, Example 3::US9682967, 3
SMILES Cc1ccc(C(=O)Nc2cccc(C)n2)c(c1)C(O)=O
InChI Key InChIKey=ISJUGEUIJOHRQC-UHFFFAOYSA-N
Data  2 KI  3 IC50
  Tab Delimited (TSV)   2D SDfile   Computed 3D by Vconf -m prep SDfile
Find this compound or compounds like it in BindingDB:
Activity Spreadsheet -- Enzyme Inhibition Constant Data from BindingDB
Found 4 hits for monomerid = 50445056
TargetSortilin(Homo sapiens (Human))
H. Lundbeck
US Patent
LigandPNGBDBM50445056(CHEMBL3098743 | US10195186, Example 3 | US9682967,...)
Affinity DataKi:  6.10E+3nM IC50:  6.40E+3nMpH: 7.4Assay Description:The Sortilin assay was performed in total volume of 40 ul in 50 mM HEPES pH 7.4 assay buffer containing 100 mM NaCl, 2.0 mM CaCl2, 0.1% BSA and 0.1% ...
In DepthDetails US Patent
TargetSortilin(Homo sapiens (Human))
H. Lundbeck
US Patent
LigandPNGBDBM50445056(CHEMBL3098743 | US10195186, Example 3 | US9682967,...)
Affinity DataKi:  6.10E+3nM. Assay description: The Sortilin assay was performed in total volume of 40 ul in 50 mM HEPES pH 7.4 assay buffer containing 100 mM NaCl, 2.0 mM CaCl2, 0.1% BSA and 0.1% ...
In DepthDetails US Patent
TargetSortilin(Homo sapiens (Human))
H. Lundbeck
US Patent
LigandPNGBDBM50445056(CHEMBL3098743 | US10195186, Example 3 | US9682967,...)
Affinity DataIC50:  6.40E+3nM. Assay description: The Sortilin assay was performed in total volume of 40 ul in 50 mM HEPES pH 7.4 assay buffer containing 100 mM NaCl, 2.0 mM CaCl2, 0.1% BSA and 0.1% ...
In DepthDetails US Patent
TargetSortilin(Homo sapiens (Human))
H. Lundbeck
US Patent
LigandPNGBDBM50445056(CHEMBL3098743 | US10195186, Example 3 | US9682967,...)
Affinity DataIC50:  6.40E+3nM. Assay description: Displacement of [3H]-neurotensin from sortilin (unknown origin) incubated 30 mins prior to [3H]-neurotensin addition measured after 6 hrs by scintill...
In DepthDetails ArticlePubMed