BDBM50445183 CHEMBL438397
SMILES CC[C@H](C)[C@H](NC(=O)CNC(=O)[C@H](C)NC(=O)[C@H](C)NC(=O)[C@H](Cc1cnc[nH]1)NC(=O)[C@H](CC(N)=O)NC(=O)CNC(=O)[C@H](C)NC(=O)CNC(=O)[C@H](Cc1cnc[nH]1)NC(=O)[C@H](CC(C)C)NC(=O)[C@H](CC(C)C)NC(=O)[C@H](CCC(O)=O)NC(=O)[C@@H](N)Cc1ccc(O)cc1)C(=O)N[C@@H](CC(C)C)C(=O)N[C@@H]([C@@H](C)O)C(=O)N[C@@H](CC(C)C)C(N)=O
InChI Key InChIKey=JPRBZUXULYLVPJ-HYNYKCRDSA-N
Data  2 EC50
  Tab Delimited (TSV)   2D SDfile   Computed 3D by Vconf -m prep SDfile
Find this compound or compounds like it in BindingDB:
Activity Spreadsheet -- Enzyme Inhibition Constant Data from BindingDB
Found 2 hits for monomerid = 50445183
TargetOrexin/Hypocretin receptor type 1(Homo sapiens (Human))
Research Triangle Institute
Curated by ChEMBL
LigandPNGBDBM50445183(CHEMBL438397)
Affinity DataEC50:  8.30nM. Assay description: Agonist activity at human OX1 receptor overexpressed in CHO-RD-HGA16 cells assessed as calcium mobilization after 15 mins by fluorescence assay
In DepthDetails ArticlePubMed
TargetOrexin receptor type 2(Homo sapiens (Human))
Research Triangle Institute
Curated by ChEMBL
LigandPNGBDBM50445183(CHEMBL438397)
Affinity DataEC50:  187nM. Assay description: Agonist activity at human OX2 receptor overexpressed in CHO-RD-HGA16 cells assessed as calcium mobilization after 15 mins by fluorescence assay
In DepthDetails ArticlePubMed