BDBM50445416 CHEMBL3104652
SMILES Cn1c(\C=C2/NC(=O)CS2)nc2ccccc12
InChI Key InChIKey=AWNRUGWQYFGOKP-WUXMJOGZSA-N
Data  1 IC50
  Tab Delimited (TSV)   2D SDfile   Computed 3D by Vconf -m prep SDfile
Find this compound or compounds like it in BindingDB:
Activity Spreadsheet -- Enzyme Inhibition Constant Data from BindingDB
Found 1 hit for monomerid = 50445416
TargetA disintegrin and metalloproteinase with thrombospondin motifs 5(Homo sapiens (Human))
Asahi Kasei Pharma
Curated by ChEMBL
LigandPNGBDBM50445416(CHEMBL3104652)
Affinity DataIC50:  1.70E+3nM. Assay description: Inhibition of human recombinant ADAMTS-5 using interglobular domain peptide of aggrecan after 60 mins by FRET assay
In DepthDetails ArticlePubMed