BDBM50445427 CHEMBL3104668
SMILES Oc1csc(\C=C2/NC(=O)CS2)n1
InChI Key InChIKey=WOIOAZMKGAMUNZ-LREOWRDNSA-N
Data  1 IC50
  Tab Delimited (TSV)   2D SDfile   Computed 3D by Vconf -m prep SDfile
Find this compound or compounds like it in BindingDB:
Activity Spreadsheet -- Enzyme Inhibition Constant Data from BindingDB
Found 1 hit for monomerid = 50445427
TargetA disintegrin and metalloproteinase with thrombospondin motifs 5(Homo sapiens (Human))
Asahi Kasei Pharma
Curated by ChEMBL
LigandPNGBDBM50445427(CHEMBL3104668)
Affinity DataIC50:  1.40E+3nM. Assay description: Inhibition of human recombinant ADAMTS-5 using interglobular domain peptide of aggrecan after 60 mins by FRET assay
In DepthDetails ArticlePubMed