BDBM50445515 CHEMBL3103039
SMILES Clc1ccc(cc1)-n1cnc2cc(ccc12)C(=O)N1CCCCC1
InChI Key InChIKey=HLXNLMAEIDNYRY-UHFFFAOYSA-N
Data  1 IC50
  Tab Delimited (TSV)   2D SDfile   Computed 3D by Vconf -m prep SDfile
Find this compound or compounds like it in BindingDB:
Activity Spreadsheet -- Enzyme Inhibition Constant Data from BindingDB
Found 1 hit for monomerid = 50445515
Target15-hydroxyprostaglandin dehydrogenase [NAD(+)](Homo sapiens (Human))
National Center For Advancing Translational Sciences
Curated by ChEMBL
LigandPNGBDBM50445515(CHEMBL3103039)
Affinity DataIC50:  22nM. Assay description: Inhibition of human HPGD using PGE2 as substrate after 15 mins by fluorescence assay
In DepthDetails ArticlePubMed