BDBM50445558 CHEMBL2132150
SMILES Cc1cc(c(C)n1-c1ccc(F)cc1)-c1nnc2CCCCCn12
InChI Key InChIKey=AXBDECUZZDILLT-UHFFFAOYSA-N
Data  1 IC50
  Tab Delimited (TSV)   2D SDfile   Computed 3D by Vconf -m prep SDfile
Find this compound or compounds like it in BindingDB:
Activity Spreadsheet -- Enzyme Inhibition Constant Data from BindingDB
Found 1 hit for monomerid = 50445558
Target15-hydroxyprostaglandin dehydrogenase [NAD(+)](Homo sapiens (Human))
National Center For Advancing Translational Sciences
Curated by ChEMBL
LigandPNGBDBM50445558(CHEMBL2132150)
Affinity DataIC50:  121nM. Assay description: Inhibition of human HPGD using PGE2 as substrate after 15 mins by fluorescence assay
In DepthDetails ArticlePubMed