BDBM50445996 CHEMBL3103328
SMILES Clc1ccc(cc1)N1CC2CC1CN2C(=O)N1CCOCC1
InChI Key InChIKey=XJKIQOQEOXVDDW-UHFFFAOYSA-N
Data  4 IC50
  Tab Delimited (TSV)   2D SDfile   Computed 3D by Vconf -m prep SDfile
Find this compound or compounds like it in BindingDB:
Activity Spreadsheet -- Enzyme Inhibition Constant Data from BindingDB
Found 4 hits for monomerid = 50445996
TargetAldo-keto reductase family 1 member C4(Homo sapiens (Human))
University Of Auckland
Curated by ChEMBL
LigandPNGBDBM50445996(CHEMBL3103328)
Affinity DataIC50: >3.00E+4nM. Assay description: Inhibition of recombinant AKR1C4 (unknown origin) after 1 hr by competitive fluorescence assay
In DepthDetails ArticlePubMed
TargetAldo-keto reductase family 1 member C1(Homo sapiens (Human))
University Of Auckland
Curated by ChEMBL
LigandPNGBDBM50445996(CHEMBL3103328)
Affinity DataIC50: >3.00E+4nM. Assay description: Inhibition of recombinant AKR1C1 (unknown origin) after 1 hr by competitive fluorescence assay
In DepthDetails ArticlePubMed
TargetAldo-keto reductase family 1 member C2(Homo sapiens (Human))
University Of Auckland
Curated by ChEMBL
LigandPNGBDBM50445996(CHEMBL3103328)
Affinity DataIC50: >3.00E+4nM. Assay description: Inhibition of recombinant AKR1C2 (unknown origin) after 1 hr by competitive fluorescence assay
In DepthDetails ArticlePubMed
TargetAldo-keto reductase family 1 member C3(Homo sapiens (Human))
University Of Auckland
Curated by ChEMBL
LigandPNGBDBM50445996(CHEMBL3103328)
Affinity DataIC50:  3.70E+3nM. Assay description: Inhibition of recombinant AKR1C3 (unknown origin) after 1 hr by competitive fluorescence assay
In DepthDetails ArticlePubMed