BDBM50446176 CHEMBL3108996::US9518026, Example 23::US9956214, Compound 23
SMILES NC(=O)c1c(N)n(CCN2CCOCC2)nc1-c1ccc2ccccc2c1
InChI Key InChIKey=WKMPLDPKTLXJJY-UHFFFAOYSA-N
Data  5 IC50
  Tab Delimited (TSV)   2D SDfile   Computed 3D by Vconf -m prep SDfile
Find this compound or compounds like it in BindingDB:
Activity Spreadsheet -- Enzyme Inhibition Constant Data from BindingDB
Found 5 hits for monomerid = 50446176
TargetCalmodulin-domain protein kinase 1(Toxoplasma gondii)
University Of Washington
Curated by ChEMBL
LigandPNGBDBM50446176(CHEMBL3108996 | US9518026, Example 23 | US9956214,...)
Affinity DataIC50:  5nM. Assay description: Inhibition of Toxoplasma gondii CDPK1 using PLARTLSVAGLPGKK-OH as substrate
In DepthDetails ArticlePubMed
TargetCalmodulin-domain protein kinase 1(Toxoplasma gondii)
University Of Washington
Curated by ChEMBL
LigandPNGBDBM50446176(CHEMBL3108996 | US9518026, Example 23 | US9956214,...)
Affinity DataIC50:  5nM. Assay description: Inhibition of TgCDPK1 and CpCDPK1 was determined using a luminescent kinase assay which measures ATP depletion in the presence of the Syntide 2 pepti...
In DepthDetails US Patent
TargetCalcium-dependent protein kinase 1(Cryptosporidium parvum)
University Of Washington Through Its Center For Commercialization
US Patent
LigandPNGBDBM50446176(CHEMBL3108996 | US9518026, Example 23 | US9956214,...)
Affinity DataIC50:  18nM. Assay description: Inhibition of TgCDPK1 and CpCDPK1 was determined using a luminescent kinase assay which measures ATP depletion in the presence of the Syntide 2 pepti...
In DepthDetails US Patent
TargetCalmodulin-domain protein kinase 1(Toxoplasma gondii)
University Of Washington
Curated by ChEMBL
LigandPNGBDBM50446176(CHEMBL3108996 | US9518026, Example 23 | US9956214,...)
Affinity DataIC50:  5nM. Assay description: Inhibition of TgCDPK1 and CpCDPK1 was determined using a luminescent kinase assay which measures ATP depletion in the presence of the Syntide 2 pepti...
In DepthDetails US Patent
TargetUncharacterized protein(Cryptosporidium parvum)
University Of Washington Through Its Center For Commercialization
US Patent
LigandPNGBDBM50446176(CHEMBL3108996 | US9518026, Example 23 | US9956214,...)
Affinity DataIC50:  18nM. Assay description: Inhibition of TgCDPK1 and CpCDPK1 was determined using a luminescent kinase assay which measures ATP depletion in the presence of the Syntide 2 pepti...
In DepthDetails US Patent