BDBM50446207 CHEMBL3109051
SMILES COc1cc(ccc1NC(=O)C1NC(CC(C)(C)C)C2(C1c1cccc(Cl)c1F)C(=O)Nc1cc(Cl)ncc21)C(N)=O
InChI Key InChIKey=CGCOPBXAGSCZNX-UHFFFAOYSA-N
Data  1 IC50
  Tab Delimited (TSV)   2D SDfile   Computed 3D by Vconf -m prep SDfile
Find this compound or compounds like it in BindingDB:
Activity Spreadsheet -- Enzyme Inhibition Constant Data from BindingDB
Found 1 hit for monomerid = 50446207
TargetE3 ubiquitin-protein ligase Mdm2(Homo sapiens (Human))
Roche Pharma Research
Curated by ChEMBL
LigandPNGBDBM50446207(CHEMBL3109051)
Affinity DataIC50:  17nM. Assay description: Binding affinity to GST-tagged MDM2 (unknown origin) assessed as inhibition of interaction with biotinylated p53 after 1 hr by HTRF assay
In DepthDetails ArticlePubMed