BDBM50446234 CHEMBL3109175
SMILES Cc1nnc(CCCCCCCCCCN=[N+]=[N-])n1C1CC2CCC(C1)N2CC[C@H](NC(=O)C1CCC(F)(F)CC1)c1ccccc1
InChI Key InChIKey=YGWBPRKJJOXDTN-FPOPRHALSA-N
Data  1 IC50
  Tab Delimited (TSV)   2D SDfile   Computed 3D by Vconf -m prep SDfile
Find this compound or compounds like it in BindingDB:
Activity Spreadsheet -- Enzyme Inhibition Constant Data from BindingDB
Found 1 hit for monomerid = 50446234
TargetC-C chemokine receptor type 5(Homo sapiens (Human))
The Scripps Research Institute
Curated by ChEMBL
LigandPNGBDBM50446234(CHEMBL3109175)
Affinity DataIC50:  0.960nM. Assay description: Antagonist activity against CCR5 receptor in human TZM-bl cells assessed as inhibition of HIV-1 JR-FL-induced cell-cell fusion between viral envelope...
In DepthDetails ArticlePubMed