BDBM50446243 CHEMBL3109185
SMILES Nc1cc(O)cc(c1)-c1nc(N2CCOCC2)c2oc3ncccc3c2n1
InChI Key InChIKey=GLRIVBFMSWURTM-UHFFFAOYSA-N
Data  1 IC50
PDB links: 1 PDB ID matches this monomer.
  Tab Delimited (TSV)   2D SDfile   Computed 3D by Vconf -m prep SDfile
Find this compound or compounds like it in BindingDB:
Activity Spreadsheet -- Enzyme Inhibition Constant Data from BindingDB
Found 1 hit for monomerid = 50446243
TargetPhosphatidylinositol 4,5-bisphosphate 3-kinase catalytic subunit alpha isoform(Homo sapiens (Human))
Shanghai Jiao Tong University
Curated by ChEMBL
LigandPNGBDBM50446243(CHEMBL3109185)
Affinity DataIC50:  21nM. Assay description: Inhibition of N-terminal His-6-tagged full length human PI3Kalpha expressed in baculovirus-infected sf9 cells after 30 mins by TR-FRET assay