BDBM50446631 CHEMBL3116496
SMILES CCNc1nnc(o1)-c1cnc(N2CCN([C@@H](CC)C2)C2CCN(CC2)C(=O)c2ccc(Cl)cc2)c(C)n1
InChI Key InChIKey=SJHKZUZRGBEPFZ-NRFANRHFSA-N
Data  1 IC50
  Tab Delimited (TSV)   2D SDfile   Computed 3D by Vconf -m prep SDfile
Find this compound or compounds like it in BindingDB:
Activity Spreadsheet -- Enzyme Inhibition Constant Data from BindingDB
Found 1 hit for monomerid = 50446631
TargetC-X-C chemokine receptor type 3(Homo sapiens (Human))
Merck Research Laboratories
Curated by ChEMBL
LigandPNGBDBM50446631(CHEMBL3116496)
Affinity DataIC50:  1.20nM. Assay description: Binding affinity to human CXCR3 receptor
In DepthDetails ArticlePubMed