BDBM50446672 CHEMBL3113592
SMILES CC(C)(CO)[C@@H](O)CNS(=O)(=O)NC[C@H]1O[C@H]([C@H](O)[C@@H]1O)n1cnc2c(N)ncnc12
InChI Key InChIKey=NORWHRFFSINURL-YCXYSXLESA-N
Data  1 KI
  Tab Delimited (TSV)   2D SDfile   Computed 3D by Vconf -m prep SDfile
Find this compound or compounds like it in BindingDB:
Activity Spreadsheet -- Enzyme Inhibition Constant Data from BindingDB
Found 1 hit for monomerid = 50446672
TargetPantothenate synthetase(Mycobacterium tuberculosis (strain ATCC 25618 / H3...)
Soochow University
Curated by ChEMBL
LigandPNGBDBM50446672(CHEMBL3113592)
Affinity DataKi:  3.47E+3nM. Assay description: Competitive inhibition of Mycobacterium tuberculosis recombinant PanC expressed in Escherichia coli BL21 (DE3) using pantoic acid and ATP as substrat...
In DepthDetails ArticlePubMed