BDBM50446754 CHEMBL3114609
SMILES OC(=O)c1ccc(OC2CCN(CC2)C(=O)N[C@H]2C[C@@H]2c2ccccc2)c(Cl)c1
InChI Key InChIKey=VYIHTZCGBYAQRV-MJGOQNOKSA-N
Data  4 IC50
  Tab Delimited (TSV)   2D SDfile   Computed 3D by Vconf -m prep SDfile
Find this compound or compounds like it in BindingDB:
Activity Spreadsheet -- Enzyme Inhibition Constant Data from BindingDB
Found 4 hits for monomerid = 50446754
TargetCytochrome P450 2C19(Homo sapiens (Human))
Dainippon Sumitomo Pharma
Curated by ChEMBL
LigandPNGBDBM50446754(CHEMBL3114609)
Affinity DataIC50: >5.00E+4nM. Assay description: Inhibition of CYP2C19 in human liver microsomes after 10 mins by LC/MS/MS analysis
In DepthDetails ArticlePubMed
TargetBifunctional epoxide hydrolase 2(Homo sapiens (Human))
Dainippon Sumitomo Pharma
Curated by ChEMBL
LigandPNGBDBM50446754(CHEMBL3114609)
Affinity DataIC50:  2.60nM. Assay description: Inhibition of human recombinant soluble epoxide hydrolase after 1 hr by fluorescence assay
In DepthDetails ArticlePubMed
TargetBifunctional epoxide hydrolase 2(Rattus norvegicus)
Dainippon Sumitomo Pharma
Curated by ChEMBL
LigandPNGBDBM50446754(CHEMBL3114609)
Affinity DataIC50:  4.10nM. Assay description: Inhibition of rat recombinant soluble epoxide hydrolase after 1 hr by fluorescence assay
In DepthDetails ArticlePubMed
TargetCytochrome P450 2C8(Homo sapiens (Human))
Dainippon Sumitomo Pharma
Curated by ChEMBL
LigandPNGBDBM50446754(CHEMBL3114609)
Affinity DataIC50: >5.00E+4nM. Assay description: Inhibition of CYP2C8 in human liver microsomes after 10 mins by LC/MS/MS analysis
In DepthDetails ArticlePubMed