BDBM50446806 CHEMBL3115072
SMILES OC(=O)[C@@H]1Cc2cn(CCCCCOc3ccc(Cl)c(c3)C(=O)N1)cn2
InChI Key InChIKey=VOZWZDMFSQVZQP-INIZCTEOSA-N
Data  1 IC50
  Tab Delimited (TSV)   2D SDfile   Computed 3D by Vconf -m prep SDfile
Find this compound or compounds like it in BindingDB:
Activity Spreadsheet -- Enzyme Inhibition Constant Data from BindingDB
Found 1 hit for monomerid = 50446806
TargetIntegrin alpha-2/beta-1(Homo sapiens (Human))
Sanofi R & D
Curated by ChEMBL
LigandPNGBDBM50446806(CHEMBL3115072)
Affinity DataIC50:  731nM. Assay description: Antagonist activity at recombinant integrin alpha2 beta1 receptor (unknown origin) assessed as inhibition of interaction with biotinylated collagen t...
In DepthDetails ArticlePubMed