BDBM50446831 CHEMBL3114875
SMILES OC(=O)[C@@H]1Cc2cccc(OCCCCOc3ccc(c(F)c3)C(=O)N1)c2
InChI Key InChIKey=DTOUJXKXZBWHJK-SFHVURJKSA-N
Data  1 IC50
  Tab Delimited (TSV)   2D SDfile   Computed 3D by Vconf -m prep SDfile
Find this compound or compounds like it in BindingDB:
Activity Spreadsheet -- Enzyme Inhibition Constant Data from BindingDB
Found 1 hit for monomerid = 50446831
TargetIntegrin alpha-2/beta-1(Homo sapiens (Human))
Sanofi R & D
Curated by ChEMBL
LigandPNGBDBM50446831(CHEMBL3114875)
Affinity DataIC50: >4.00E+3nM. Assay description: Antagonist activity at recombinant integrin alpha2 beta1 receptor (unknown origin) assessed as inhibition of interaction with biotinylated collagen t...
In DepthDetails ArticlePubMed