BDBM50446839 CHEMBL3114867
SMILES OC(=O)[C@@H]1Cc2ccc(OC\C=C\COc3cccc(Cl)c3C(=O)N1)cc2
InChI Key InChIKey=BAWJRRUGVCVUHL-PYKQWIPUSA-N
Data  1 IC50
  Tab Delimited (TSV)   2D SDfile   Computed 3D by Vconf -m prep SDfile
Find this compound or compounds like it in BindingDB:
Activity Spreadsheet -- Enzyme Inhibition Constant Data from BindingDB
Found 1 hit for monomerid = 50446839
TargetIntegrin alpha-2/beta-1(Homo sapiens (Human))
Sanofi R & D
Curated by ChEMBL
LigandPNGBDBM50446839(CHEMBL3114867)
Affinity DataIC50:  178nM. Assay description: Antagonist activity at recombinant integrin alpha2 beta1 receptor (unknown origin) assessed as inhibition of interaction with biotinylated collagen t...
In DepthDetails ArticlePubMed