BDBM50447228 CHEMBL3113158::US10752581, Compound 28
SMILES COc1ccc(CNc2ccc(cc2)S(=O)(=O)Nc2nccs2)c(O)c1
InChI Key InChIKey=IHQVIJXMMBYWEJ-UHFFFAOYSA-N
Data  2 IC50
  Tab Delimited (TSV)   2D SDfile   Computed 3D by Vconf -m prep SDfile
Find this compound or compounds like it in BindingDB:
Activity Spreadsheet -- Enzyme Inhibition Constant Data from BindingDB
Found 2 hits for monomerid = 50447228
TargetPolyunsaturated fatty acid lipoxygenase ALOX12(Homo sapiens (Human))
Eastern Virginia Medical School
US Patent
LigandPNGBDBM50447228(CHEMBL3113158 | US10752581, Compound 28)
Affinity DataIC50:  2.20E+4nM. Assay description: UV-vis cuvette-based assay.
In DepthDetails US Patent
TargetPolyunsaturated fatty acid lipoxygenase ALOX12(Homo sapiens (Human))
Eastern Virginia Medical School
US Patent
LigandPNGBDBM50447228(CHEMBL3113158 | US10752581, Compound 28)
Affinity DataIC50:  2.20E+4nM. Assay description: Inhibition of N-terminal His6-tagged human platelet 12-LOX using arachidonic acid as substrate by UV-vis spectrophotometric analysis
In DepthDetails ArticlePubMed