BDBM50447279 CHEMBL3114184
SMILES CC#C[C@@H]1CN(CCN1c1ccc(cc1)C(O)(C(F)(F)F)C(F)(F)F)S(=O)(=O)c1ccc(N)nc1
InChI Key InChIKey=SIFKNECWLVONIH-MRXNPFEDSA-N
Data  1 IC50  1 EC50
  Tab Delimited (TSV)   2D SDfile   Computed 3D by Vconf -m prep SDfile
Find this compound or compounds like it in BindingDB:
Activity Spreadsheet -- Enzyme Inhibition Constant Data from BindingDB
Found 2 hits for monomerid = 50447279
TargetHexokinase-4(Homo sapiens (Human))
Amgen
Curated by ChEMBL
LigandPNGBDBM50447279(CHEMBL3114184)
Affinity DataIC50:  484nM. Assay description: Inhibition of fluorescein-labeled human GK interaction with biotin-labeled human GKRP incubated for 20 mins prior to addition of fluorescein-labeled ...
In DepthDetails ArticlePubMed
TargetHexokinase-4(Mus musculus (Mouse))
Amgen
Curated by ChEMBL
LigandPNGBDBM50447279(CHEMBL3114184)
Affinity DataEC50: >1.25E+4nM. Assay description: Induction of GK translocation from nucleus to cytoplasm of mouse hepatocytes preincubated for 20 mins followed by glucose challenge measured after 40...
In DepthDetails ArticlePubMed