BDBM50447294 CHEMBL3114193
SMILES CCNC(=O)Nc1nc2cc(-c3ccc4cnnn4c3)c(=O)n(C(C)C)c2s1
InChI Key InChIKey=YSUBCEOGBDXSQS-UHFFFAOYSA-N
Data  1 IC50
  Tab Delimited (TSV)   2D SDfile   Computed 3D by Vconf -m prep SDfile
Find this compound or compounds like it in BindingDB:
Activity Spreadsheet -- Enzyme Inhibition Constant Data from BindingDB
Found 1 hit for monomerid = 50447294
TargetDNA gyrase subunit B(Mycobacterium smegmatis)
Astrazeneca
Curated by ChEMBL
LigandPNGBDBM50447294(CHEMBL3114193)
Affinity DataIC50:  16nM. Assay description: Inhibition of Mycobacterium smegmatis DNA gyrase B ATPase activity after 100 mins
In DepthDetails ArticlePubMed