BDBM50447310 CHEMBL3114195
SMILES CCNC(=O)Nc1nc2cc(-c3cccnc3)c(=O)n(C(C)C(O)=O)c2s1
InChI Key InChIKey=XGAMHWBNQFNHNU-UHFFFAOYSA-N
Data  1 IC50
  Tab Delimited (TSV)   2D SDfile   Computed 3D by Vconf -m prep SDfile
Find this compound or compounds like it in BindingDB:
Activity Spreadsheet -- Enzyme Inhibition Constant Data from BindingDB
Found 1 hit for monomerid = 50447310
TargetDNA gyrase subunit B(Mycobacterium smegmatis)
Astrazeneca
Curated by ChEMBL
LigandPNGBDBM50447310(CHEMBL3114195)
Affinity DataIC50:  2.87E+3nM. Assay description: Inhibition of Mycobacterium smegmatis DNA gyrase B ATPase activity after 100 mins
In DepthDetails ArticlePubMed