BDBM50447458 CHEMBL3115158
SMILES COc1cccc(CNC(=O)CNS(=O)(=O)c2ccc3[nH]c(=O)oc3c2)c1
InChI Key InChIKey=AJTCZVBJSRIBCC-UHFFFAOYSA-N
Data  3 IC50
  Tab Delimited (TSV)   2D SDfile   Computed 3D by Vconf -m prep SDfile
Find this compound or compounds like it in BindingDB:
Activity Spreadsheet -- Enzyme Inhibition Constant Data from BindingDB
Found 3 hits for monomerid = 50447458
TargetAlkaline phosphatase, placental type(Homo sapiens (Human))
Sanford-Burnham Medical Research Institute
Curated by ChEMBL
LigandPNGBDBM50447458(CHEMBL3115158)
Affinity DataIC50: >1.00E+5nM. Assay description: Inhibition of FLAG-tagged PLAP (unknown origin) expressed in African green monkey COS1 cells after 30 mins by chemiluminescence assay
In DepthDetails ArticlePubMed
TargetIntestinal-type alkaline phosphatase(Mus musculus)
Sanford-Burnham Medical Research Institute
Curated by ChEMBL
LigandPNGBDBM50447458(CHEMBL3115158)
Affinity DataIC50:  730nM. Assay description: Inhibition of mouse duodenal-specific FLAG-tagged IAP expressed in African green monkey COS1 cells after 30 mins by chemiluminescence assay
In DepthDetails ArticlePubMed
TargetAlkaline phosphatase, tissue-nonspecific isozyme(Homo sapiens (Human))
Sanford-Burnham Medical Research Institute
Curated by ChEMBL
LigandPNGBDBM50447458(CHEMBL3115158)
Affinity DataIC50:  7.40E+4nM. Assay description: Inhibition of FLAG-tagged TNAP (unknown origin) expressed in African green monkey COS1 cells after 30 mins by chemiluminescence assay
In DepthDetails ArticlePubMed