BDBM50447505 CHEMBL3115391
SMILES CC(C)(C)c1ccc(cc1)C(=O)N1Cc2ccc(nc2Nc2ccccc12)C(F)(F)F
InChI Key InChIKey=WQJPMCOZOVKSRK-UHFFFAOYSA-N
Data  4 EC50
  Tab Delimited (TSV)   2D SDfile   Computed 3D by Vconf -m prep SDfile
Find this compound or compounds like it in BindingDB:
Activity Spreadsheet -- Enzyme Inhibition Constant Data from BindingDB
Found 4 hits for monomerid = 50447505
TargetBombesin receptor subtype-3(Homo sapiens (Human))
Daiichi Sankyo
Curated by ChEMBL
LigandPNGBDBM50447505(CHEMBL3115391)
Affinity DataEC50: >1.00E+4nM. Assay description: Agonist activity at human BRS3 expressed in CHO-K1 cells by IP-One HTRF assay
In DepthDetails ArticlePubMed
TargetBombesin receptor subtype-3(Homo sapiens (Human))
Daiichi Sankyo
Curated by ChEMBL
LigandPNGBDBM50447505(CHEMBL3115391)
Affinity DataEC50: >1.00E+4nM. Assay description: Agonist activity at human BRS-3 expressed in CHOK1 cells after 1 hr by HTRF assay
In DepthDetails ArticlePubMed
TargetBombesin receptor subtype-3(Mus musculus)
Daiichi Sankyo
Curated by ChEMBL
LigandPNGBDBM50447505(CHEMBL3115391)
Affinity DataEC50: >1.00E+4nM. Assay description: Agonist activity at mouse BRS-3 expressed in CHOK1 cells after 1 hr by HTRF assay
In DepthDetails ArticlePubMed
TargetBombesin receptor subtype-3(Mus musculus)
Daiichi Sankyo
Curated by ChEMBL
LigandPNGBDBM50447505(CHEMBL3115391)
Affinity DataEC50: >1.00E+4nM. Assay description: Agonist activity at mouse BRS3 expressed in CHO-K1 cells by IP-One HTRF assay
In DepthDetails ArticlePubMed