BDBM50447543 CHEMBL3116343
SMILES Fc1cc(cc(c1)[C@](Cc1ccccc1)(Nc1nc2CCCCc2s1)c1ccc(Cl)cn1)C(F)(F)F
InChI Key InChIKey=PQVJKJVNAQMFDJ-SANMLTNESA-N
Data  1 IC50
  Tab Delimited (TSV)   2D SDfile   Computed 3D by Vconf -m prep SDfile
Find this compound or compounds like it in BindingDB:
Activity Spreadsheet -- Enzyme Inhibition Constant Data from BindingDB
Found 1 hit for monomerid = 50447543
TargetCholesteryl ester transfer protein(Homo sapiens (Human))
Bristol-Myers Squibb
Curated by ChEMBL
LigandPNGBDBM50447543(CHEMBL3116343)
Affinity DataIC50:  1.08E+4nM. Assay description: Inhibition of human recombinant CETP using [3H]-CE/HDL by scintillation proximity assay
In DepthDetails ArticlePubMed