BDBM50448291 CHEMBL3121099
SMILES CC(C)N1N=C(C2CC2C1=O)c1ccc(OC2CCN(CC2)C2CCC2)cc1
InChI Key InChIKey=OWWNOLJFXMYDST-UHFFFAOYSA-N
Data  1 KI
  Tab Delimited (TSV)   2D SDfile   Computed 3D by Vconf -m prep SDfile
Find this compound or compounds like it in BindingDB:
Activity Spreadsheet -- Enzyme Inhibition Constant Data from BindingDB
Found 1 hit for monomerid = 50448291
TargetHistamine H3 receptor(Rattus norvegicus (rat))
Teva Pharmaceutical Global R & D
Curated by ChEMBL
LigandPNGBDBM50448291(CHEMBL3121099)
Affinity DataKi:  5.60nM. Assay description: Displacement of [3H]NAMH from rat histamine H3 receptor transfected in CHO cells
In DepthDetails ArticlePubMed