BDBM50448473 CHEMBL3126399
SMILES [#6]-[#6@H](-[#7]-[#6](=O)-[#6@H](-[#6]-[#6]-[#6]\[#7]=[#6](/[#7])-[#7])-[#7]-[#6](-[#6])=O)-[#6](=O)-[#7]-[#6@@H](-[#6]-[#6]-[#6]\[#7]=[#6](/[#7])-[#7])-[#6](=O)-[#7]-[#6@@H](-[#6]-[#6]-[#6]\[#7]=[#6](/[#7])-[#7])-[#6](=O)-[#7]-[#6@@H](-[#6]-[#6]-[#6]\[#7]=[#6](/[#7])-[#7])-[#6](=O)-[#7]-[#6@@H](-[#6]-[#6]-[#6]-[#6]-[#7])-[#6](=O)-[#7]-[#6@@H](-[#6]-[#6]-[#6]-[#6]-[#7])-[#6](=O)-[#7]-[#6]-c1ccc(cc1)-[#6](-[#7])=[#7]
InChI Key InChIKey=SFJBLMMPANHNRF-KHLMYIKTSA-N
Data  2 KI
  Tab Delimited (TSV)   2D SDfile   Computed 3D by Vconf -m prep SDfile
Find this compound or compounds like it in BindingDB:
Activity Spreadsheet -- Enzyme Inhibition Constant Data from BindingDB
Found 2 hits for monomerid = 50448473
TargetFurin(Homo sapiens (Human))
Universit£
Curated by ChEMBL
LigandPNGBDBM50448473(CHEMBL3126399)
Affinity DataKi:  1.90nM. Assay description: Competitive inhibition of recombinant furin (unknown origin) using as substrate after 60 mins
In DepthDetails ArticlePubMed
TargetFurin(Homo sapiens (Human))
Universit£
Curated by ChEMBL
LigandPNGBDBM50448473(CHEMBL3126399)
Affinity DataKi:  3.80nM. Assay description: Inhibition of furin (unknown origin)
In DepthDetails PubMed