BDBM50448487 CHEMBL2385821
SMILES Cc1cc(Nc2cccc(NC(=O)c3ccc(Nc4ccnc5ccccc45)cc3)c2)nc(N)n1
InChI Key InChIKey=WSJHXZVJUNDCKJ-UHFFFAOYSA-N
Data  5 IC50
  Tab Delimited (TSV)   2D SDfile   Computed 3D by Vconf -m prep SDfile
Find this compound or compounds like it in BindingDB:
Activity Spreadsheet -- Enzyme Inhibition Constant Data from BindingDB
Found 5 hits for monomerid = 50448487
TargetHistone-lysine N-methyltransferase EHMT1(Homo sapiens (Human))
Sapienza University Of Rome
Curated by ChEMBL
LigandPNGBDBM50448487(CHEMBL2385821)
Affinity DataIC50:  6.00E+5nM. Assay description: Inhibition of human GLP (734 to 1235) using histone as substrate preincubated for 5 mins followed by substrate addition measured after 5 mins by liqu...
In DepthDetails ArticlePubMed
TargetProtein arginine N-methyltransferase 1(Rattus norvegicus)
Sapienza University Of Rome
Curated by ChEMBL
LigandPNGBDBM50448487(CHEMBL2385821)
Affinity DataIC50:  3.00E+5nM. Assay description: Inhibition of rat recombinant PRMT1 using histone as substrate preincubated for 5 mins followed by substrate addition measured after 6.5 mins by liqu...
In DepthDetails ArticlePubMed
TargetDNA (cytosine-5)-methyltransferase 1(Homo sapiens (Human))
Sapienza University Of Rome
Curated by ChEMBL
LigandPNGBDBM50448487(CHEMBL2385821)
Affinity DataIC50:  370nM. Assay description: Inhibition of human N-terminal 600 residues-deleted DNMT1 using poly(dI-dC) as substrate in presence of AdoMet
In DepthDetails ArticlePubMed
TargetDNA (cytosine-5)-methyltransferase 1(Homo sapiens (Human))
Sapienza University Of Rome
Curated by ChEMBL
LigandPNGBDBM50448487(CHEMBL2385821)
Affinity DataIC50:  5.20E+4nM. Assay description: Inhibition of human N-terminal 600 residues-deleted DNMT1 using hemimethylated (GAC)12 as substrate preincubated for 5 mins followed by substrate add...
In DepthDetails ArticlePubMed
TargetDNA (cytosine-5)-methyltransferase 3-like(Homo sapiens (Human))
Sapienza University Of Rome
Curated by ChEMBL
LigandPNGBDBM50448487(CHEMBL2385821)
Affinity DataIC50:  2.10E+4nM. Assay description: Inhibition of human DNMT3A2/3L using unmethylated DNA as substrate in presence of [methyl-3H]-AdoMet
In DepthDetails ArticlePubMed