BDBM50448645 CHEMBL3127512
SMILES O=C(NCCCCS(=O)(=O)c1ccccc1)c1ccc2nccn2c1
InChI Key InChIKey=ZZNSFVBYBGNFBP-UHFFFAOYSA-N
Data  1 IC50  1 Kd
  Tab Delimited (TSV)   2D SDfile   Computed 3D by Vconf -m prep SDfile
Find this compound or compounds like it in BindingDB:
Activity Spreadsheet -- Enzyme Inhibition Constant Data from BindingDB
Found 2 hits for monomerid = 50448645
TargetNicotinamide phosphoribosyltransferase(Homo sapiens (Human))
Genentech
Curated by ChEMBL
LigandPNGBDBM50448645(CHEMBL3127512)
Affinity DataKd:  860nM. Assay description: Binding affinity to NAMPT (2 to 491) (unknown origin) by surface plasmon resonance analysis
In DepthDetails ArticlePubMed
TargetNicotinamide phosphoribosyltransferase(Homo sapiens (Human))
Genentech
Curated by ChEMBL
LigandPNGBDBM50448645(CHEMBL3127512)
Affinity DataIC50:  750nM. Assay description: Inhibition of C-terminal His-tagged human full-length NAMPT expressed in Escherichia coli Rosetta DE3 using nicotinamide as substrate preincubated fo...
In DepthDetails ArticlePubMed