BDBM50448697 CHEMBL3127858
SMILES O[C@@]12CC3CC(C1)[C@H](NC(=O)c1sc(OC4CCOCC4)nc1[C@H]1CCCO1)C(C3)C2
InChI Key InChIKey=PKFRAMMZHQBMFC-WIRDFQLBSA-N
Data  4 IC50
  Tab Delimited (TSV)   2D SDfile   Computed 3D by Vconf -m prep SDfile
Find this compound or compounds like it in BindingDB:
Activity Spreadsheet -- Enzyme Inhibition Constant Data from BindingDB
Found 4 hits for monomerid = 50448697
TargetBifunctional epoxide hydrolase 2(Homo sapiens (Human))
Astrazeneca
Curated by ChEMBL
LigandPNGBDBM50448697(CHEMBL3127858)
Affinity DataIC50: >3.30E+4nM. Assay description: Inhibition of sEH (unknown origin)
In DepthDetails ArticlePubMed
Target11-beta-hydroxysteroid dehydrogenase 1(Mus musculus (mouse))
Astrazeneca
Curated by ChEMBL
LigandPNGBDBM50448697(CHEMBL3127858)
Affinity DataIC50:  14nM. Assay description: Inhibition of N-terminal 6-His-tagged full-length mouse 11beta-HSD1 assessed as conversion of cortisone to cortisol after 25 mins by competitive HTRF...
In DepthDetails ArticlePubMed
Target11-beta-hydroxysteroid dehydrogenase 1(Homo sapiens (Human))
Astrazeneca
Curated by ChEMBL
LigandPNGBDBM50448697(CHEMBL3127858)
Affinity DataIC50:  1.70nM. Assay description: Inhibition of recombinant human 11beta-HSD1 using cortisone/[3H]-cortisone as substrate after 5 hrs by reverse-phase HPLC analysis
In DepthDetails ArticlePubMed
Target11-beta-hydroxysteroid dehydrogenase 1(Homo sapiens (Human))
Astrazeneca
Curated by ChEMBL
LigandPNGBDBM50448697(CHEMBL3127858)
Affinity DataIC50:  17nM. Assay description: Inhibition of N-terminal 6-His-tagged full-length human 11beta-HSD1 assessed as conversion of cortisone to cortisol after 25 mins by competitive HTRF...
In DepthDetails ArticlePubMed